Supplementary Table 1,Unnamed: 1,"Demographic, clinical, and autoantibody data ",Unnamed: 3,Unnamed: 4,Unnamed: 5,Unnamed: 6,Unnamed: 7,Unnamed: 8,Unnamed: 9,Unnamed: 10,Unnamed: 11,Unnamed: 12,Unnamed: 13,Unnamed: 14,Unnamed: 15,Unnamed: 16,Unnamed: 17,Unnamed: 18,Unnamed: 19,Unnamed: 20,Unnamed: 21,Unnamed: 22,Unnamed: 23,Unnamed: 24,Unnamed: 25,Unnamed: 26,Unnamed: 27,Unnamed: 28,Unnamed: 29,Unnamed: 30,Unnamed: 31,Unnamed: 32,Unnamed: 33,Unnamed: 34,Unnamed: 35,Unnamed: 36,Unnamed: 37,Unnamed: 38,Unnamed: 39,Unnamed: 40,Unnamed: 41,Unnamed: 42,Unnamed: 43,Unnamed: 44,Unnamed: 45,Unnamed: 46,Unnamed: 47,Unnamed: 48,Unnamed: 49,Unnamed: 50,Unnamed: 51,Unnamed: 52,Unnamed: 53,Unnamed: 54,Unnamed: 55,Unnamed: 56,Unnamed: 57,Unnamed: 58,Unnamed: 59,Unnamed: 60,Unnamed: 61,Unnamed: 62,Unnamed: 63,Unnamed: 64,Unnamed: 65,Unnamed: 66,Unnamed: 67,Unnamed: 68,Unnamed: 69,Unnamed: 70,Unnamed: 71,Unnamed: 72,Unnamed: 73,Unnamed: 74,Unnamed: 75,Unnamed: 76,Unnamed: 77,Unnamed: 78,Unnamed: 79,Unnamed: 80,Unnamed: 81,Unnamed: 82,Unnamed: 83,Unnamed: 84,Unnamed: 85,Unnamed: 86,Unnamed: 87,Unnamed: 88,Unnamed: 89,Unnamed: 90,Unnamed: 91,Unnamed: 92,Unnamed: 93,Unnamed: 94,Unnamed: 95,Unnamed: 96,Unnamed: 97,Unnamed: 98,Unnamed: 99,Unnamed: 100,Unnamed: 101,Unnamed: 102,Unnamed: 103,Unnamed: 104,Unnamed: 105,Unnamed: 106,Unnamed: 107,Unnamed: 108,Unnamed: 109,Unnamed: 110,Unnamed: 111,Unnamed: 112,Unnamed: 113,Unnamed: 114,Unnamed: 115,Unnamed: 116,Unnamed: 117,Unnamed: 118,Unnamed: 119,Unnamed: 120,Unnamed: 121,Unnamed: 122,Unnamed: 123,Unnamed: 124,Unnamed: 125,Unnamed: 126,Unnamed: 127,Unnamed: 128,Unnamed: 129,Unnamed: 130,Unnamed: 131,Unnamed: 132,Unnamed: 133,Unnamed: 134,Unnamed: 135,Unnamed: 136,Unnamed: 137,Unnamed: 138,Unnamed: 139,Unnamed: 140,Unnamed: 141,Unnamed: 142,Unnamed: 143,Unnamed: 144,Unnamed: 145,Unnamed: 146,Unnamed: 147,Unnamed: 148,Unnamed: 149,Unnamed: 150,Unnamed: 151,Unnamed: 152,Unnamed: 153,Unnamed: 154,Unnamed: 155,Unnamed: 156
,,,,,,,,,,,,,,,,,,,,,,,,,,,,,,,,,,,,,,,,,,,,,,,,,,,,,,,,,,,,,,,,,,,,,,,,,,,,,,,,,,,,,,,,,,,,,,,,,,,,,,,,,,,,,,,,,,,,,,,,,,,,,,,,,,,,,,,,,,,,,,,,,,,,,,,,,,,,
oid,site,dtype,hday,covid_nih,covid2,age,ethnicity,race2,sex,bmi,tx_i,str_dex,rdv_rx,trial,vent,pmh_hrt,pmh_pul,pmh_dm,pmh_kidney,at1r,at1r_c,ecm1_num,ecm2_num,ecmi,dexi,snrpn,ssb,il8,krt8,krt18,myosin,coll1,coll2,coll3,coll4,coll5,csf2,lgals8,shc3,agrn,perc,atp5b,snrpb2,gdnf,ifng,gstt1,eno1,lmna,ncl,prkch,prkcz,fibnec1,hars,cgb5,vegfa,vcl,arhgdib,lphn1,coll6,thyglbn,lgals3,emcn,il21,vim,tuba1b,tubulin,flrt2,stat6,apol2,cd40,cxcl11,cxcl9,gapdh,actin,pla2r1,hspb1,ror1,icam1,fas,p2ry11,ptpro,ccp,transf,tubb,albumin,igg,log10_dexi,log10_snrpn,log10_lgals3,log10_emcn,log10_ssb,log10_il21,log10_il8,log10_vim,log10_tuba1b,log10_krt8,log10_krt18,log10_tubulin,log10_myosin,log10_flrt2,log10_coll1,log10_coll2,log10_coll3,log10_coll4,log10_coll5,log10_csf2,log10_lgals8,log10_shc3,log10_stat6,log10_agrn,log10_perc,log10_atp5b,log10_apol2,log10_cd40,log10_snrpb2,log10_cxcl11,log10_gdnf,log10_ifng,log10_cxcl9,log10_gstt1,log10_eno1,log10_gapdh,log10_lmna,log10_actin,log10_ncl,log10_prkch,log10_prkcz,log10_pla2r1,log10_fibnec1,log10_hspb1,log10_ror1,log10_hars,log10_icam1,log10_cgb5,log10_fas,log10_p2ry11,log10_vegfa,log10_vcl,log10_arhgdib,log10_ptpro,log10_lphn1,log10_coll6,log10_thyglbn,log10_ccp,log10_transf,log10_tubb,tropn_ucla,tropn_shrp,tropni,ddimer_ucla,ddimer_shrp,gddimer,renin,aldo,ang2,ace
1001,1=Sharp,MIS,5,,,33,1=Hispanic,0=Other,0=female,35,0=Not Transplant,1=Steroid,0=No Remdexivir,0,0=No ventilation,0=No Cardiac Disease,0=No Pulmonary Disease,0=No Diabetes,0=No Kidney Disease,11,AT1R>=10,115,136,ECXM Positive,238,505,257,182,229,279.5,1212,239,483,1190,200,314,53,206,331,379,227,122,1273,18,108,172,16099,416,3210,2202,1804,651,274,195,366,2091.5,300,452,598,399,184,287.5,158,92,153,105.5,195,195,37,122,79,128,151,73.5,71,100.5,574,99,106,199,213,97,161,247.5,308,20061.5,,,,,,,,,,,,,,,,,,,,,,,,,,,,,,,,,,,,,,,,,,,,,,,,,,,,,,,,,,,,,,10.5,0=Troponin Negative,,1138,1000-1999,10.13,<4.01,22,38
1002,1=Sharp,COVID,6,5,Moderate-Severe,58,Unknown,Unknown,1=male,37.720001,0=Not Transplant,1=Steroid,1=Remdexivir,0,0=No ventilation,0=No Cardiac Disease,0=No Pulmonary Disease,0=No Diabetes,0=No Kidney Disease,17,AT1R>=10,44,96,ECXM Positive,400,277,230.5,2281,318.5,541.5,2039,230,473,1001,315,215,1977,234.5,479,472,291,195,829,155.5,292.5,187.5,892.5,388.5,1339,2117,327,491,351,314.5,188,3319,335,322.5,377,345,172,116,157.5,251,357.5,798,168.5,154,169.5,101,193,228.5,458,100.5,309,122,125,43,199,268,275,13,287,460,297.5,19930,2.6020601,2.4424798,2.2355285,2.0644579,2.3626709,2.1972806,3.3581252,2.3996737,2.5532761,2.5031095,2.7335985,2.9020028,3.3094172,2.2265999,2.361728,2.6748612,3.0004342,2.4983106,2.3324385,3.2960067,2.3701429,2.6803355,2.1875207,2.6739421,2.4638929,2.2900345,2.2291696,2.0043213,2.9185545,2.2855573,2.1917305,2.466126,2.3588862,2.2730012,2.9506083,2.6608655,2.589391,2.002166,3.1267805,3.3257208,2.5145478,2.4899585,2.6910815,2.0863597,2.09691,2.5453072,1.6334685,2.4976206,2.2988532,2.4281347,2.2741578,3.5210073,2.5250449,2.4393327,2.5085297,2.5763414,2.5378191,1.1139433,2.4578819,2.6627579,,9,0=Troponin Negative,,854,500-999,39.9,<3.0,,30
1003,1=Sharp,COVID,7,5,Moderate-Severe,48,1=Hispanic,0=Other,1=male,32.59,0=Not Transplant,1=Steroid,1=Remdexivir,0,0=No ventilation,0=No Cardiac Disease,0=No Pulmonary Disease,0=No Diabetes,0=No Kidney Disease,15,AT1R>=10,108,146,ECXM Positive,340.5,566.5,484,232.5,320,329,1781.5,359,674,1866,500,716,154,362,539,460,776,296,1427,75,398.5,237,260,515,542,257,2203,799,480.5,404,543,428,191,461.5,972,480.5,289,77,161,144.5,223.5,530,248.5,164,321,116,298,281.5,191.5,115,184,184,108,98,152,225,303.5,42,186.5,421,253,20129,2.5321171,2.7531998,2.4608979,1.8864907,2.6848454,2.206826,2.3664229,2.1598678,2.3492775,2.5051501,2.5171959,2.7242758,3.2507858,2.3953264,2.5550945,2.82866,3.2709117,2.6989701,2.854913,2.1875207,2.5587087,2.7315888,2.2148438,2.6627579,2.8898618,2.4712918,2.506505,2.0644579,3.154424,2.4742162,1.8750613,2.6004283,2.4494784,2.3747482,2.4149733,2.2821689,2.7118073,2.0606978,2.7339993,2.4099331,3.3430144999999998,2.2648177,2.9025469,2.2648177,2.0334237,2.6816933,1.9912261,2.6063814,2.1818435,2.3521826,2.7347999,2.6314437,2.2810333,2.4821587,2.6641717,2.9876664,2.6816933,1.6232493,2.2706788,2.6242821,,3.4,0=Troponin Negative,,<215,0<500,18.68,9.09,20,16
1004,1=Sharp,MIS,105,5,,28,0=Non-Hispanic,2=Black,1=male,33.970001220703125,0=Not Transplant,1=Steroid,0=No Remdexivir,0,0=No ventilation,1=PMH Cardiac Disease,1=PMH Pulmonary Disease,0=No Diabetes,0=No Kidney Disease,18,AT1R>=10,60,90,ECXM Positive,552,780,4815,487,554.5,360,1902,466,526,1902,627,562,169.5,464,985.5,847,523,484,1334,345,203,343,632.5,424,834,862,1399,1217.5,847,913,426,1419.5,1432.5,536,1088,608,355.5,183,217.5,335,284,501,451,258,284,293,356,216,760,148,237.5,263,400,118,152,392,376.5,80,191,568,346,19867,,,,,,,,,,,,,,,,,,,,,,,,,,,,,,,,,,,,,,,,,,,,,,,,,,,,,,,,,,,,,,41.3,1=Troponin Positive,,13007,>5000,54,18,27,8
1005,1=Sharp,COVID,25,7,Critical-Deceased,59,1=Hispanic,0=Other,1=male,40.459999,0=Not Transplant,1=Steroid,0=No Remdexivir,1,1=Ventilation,0=No Cardiac Disease,0=No Pulmonary Disease,0=No Diabetes,0=No Kidney Disease,40,AT1R>=10,41,65,ECXM Positive,462.5,358.5,391,481,318,250,738,261.5,516,1286,351,264,122,1328.5,495.5,358.5,389.5,194.5,355,207,156,150.5,4173,376,340,581,640,449,367.5,351,328.5,2598.5,929,171,494.5,564,172,162,53,172.5,204.5,108,637.5,136.5,121.5,204,342,177.5,286.5,131,237,100.5,85,69,120,176,234,96,167,300.5,279,19416,2.6651118,2.5544891,2.2355285,2.2095151,2.5921767,1.7242758,2.6821451,2.236789,2.3106933,2.5024271,2.3979399,2.0334237,2.8680563,2.8044801,2.4174716,2.7126496,3.109241,2.5453072,2.4216039,2.0863597,3.1233616,2.6950436,2.1351326,2.5544891,2.5905075,2.2889197,2.0845764,2.3096302,2.5502284,2.5340261,2.3159704,2.1931245,2.2491984,2.1775365,3.6204484,2.4571247,2.5751879,2.1172712,2.5314789,2.7641761,2.80618,2.3747482,2.6522462,2.002166,1.9294189,2.5652573,1.8388491,2.5453072,2.0791812,2.2455127,2.5165353,3.4147227,2.9680157,2.369216,2.2329962,2.6941662,2.7512791,1.9822712,2.2227166,2.4778445,,34.1,1=Troponin Positive,,1745,1000-1999,75.7,62.69,49,12
1006,1=Sharp,COVID,5,6,Critical-Deceased,45,0=Non-Hispanic,1=White,0=female,31.17,0=Not Transplant,1=Steroid,0=No Remdexivir,0,0=No ventilation,0=No Cardiac Disease,1=PMH Pulmonary Disease,0=No Diabetes,0=No Kidney Disease,15,AT1R>=10,32,55,ECXM Negative,325.5,574.5,458,226.5,264,287,2033,291,465,1115,381,718.5,142,320,311,401.5,346,141,288,158,107,178,285,311,338,293,434,526.5,1870,270,268,655,252,295,517,465,137,98,178,205,208,143,167.5,176,162,247.5,299,215.5,127,117,224.5,149,161.5,46,90,185,186,112,214,271,296,19999.5,2.5125511,2.75929,2.1367207,1.9912261,2.6608655,2.2504201,2.3550682,2.3117537,2.3180633,2.4216039,2.4578819,2.1553361,3.3081374,2.2240148,2.4638929,2.6674531,3.0472748,2.580925,2.8564267,2.1522884,2.5051501,2.4927604,2.2455127,2.6036856,2.5390761,2.149219,2.2095151,2.3935752,2.4593925,2.4756713,2.198657,2.0293837,2.3334472,2.2504201,2.454845,2.1038036,2.4927604,2.0681858,2.5289166,2.4668677,2.6374898,2.3512163,2.7213984,2.1731863,2.2081726,3.2718415,1.6627579,2.4313638,1.9542425,2.2671716,2.4281347,2.8162413,2.4014006,2.2695129,2.4698219,2.7134905,2.6674531,2.0492179,2.3304138,2.4329693,,4.3,0=Troponin Negative,,420,0<500,10.45,8.1,25,12
1007,1=Sharp,COVID,1,5,Moderate-Severe,28,0=Non-Hispanic,0=Other,0=female,43.169998,0=Not Transplant,1=Steroid,0=No Remdexivir,0,0=No ventilation,0=No Cardiac Disease,0=No Pulmonary Disease,0=No Diabetes,0=No Kidney Disease,20,AT1R>=10,22,31,ECXM Negative,564,720.5,373,821,529,1054,1813,214,727,1128,303,272,209,287,487,670,298,179,784,179,652,255,279,410,801.5,354.5,451,584,625,157,160.5,5599.5,1481,280,443,365,242.5,85,159,253,262,252,306,385,281,207,134.5,182,250.5,69,289,167,142,71.5,142,358,287,73,269,403,256,20010,2.7512791,2.8576341,2.3847117,1.9294189,2.5717089,2.2013972,2.9143431,2.4031205,2.4183013,2.7234557,3.0228405,2.4014006,3.2583978,2.4857213,2.3304138,2.8615344,3.052309,2.4814427,2.4345689,2.3201463,2.4578819,2.6875288,2.5854607,2.8260748,2.4742162,2.2528529,2.4487064,2.3159704,2.894316,2.1287222,2.2528529,2.8142476,2.2600713,2.4065402,2.4456041,2.3988078,2.6127839,1.8388491,2.9039035,2.5496163,2.6541765,2.4608979,2.7664127,2.2227166,2.1522884,2.7958801,1.854306,2.1958997,2.1522884,2.5538831,2.2054751,3.7481492,3.1705551,2.4578819,2.4471581,2.6464038,2.5622928,1.8633229,2.4297523,2.605305,,2.9,0=Troponin Negative,,367,0<500,21.63,,18,18
1008,1=Sharp,COVID,4,5,Moderate-Severe,50,0=Non-Hispanic,1=White,1=male,57.330002,0=Not Transplant,1=Steroid,1=Remdexivir,0,0=No ventilation,1=PMH Cardiac Disease,0=No Pulmonary Disease,0=No Diabetes,0=No Kidney Disease,11,AT1R>=10,,,,479,208,261.5,120,229.5,216.5,1982.5,944.5,1265,3592,1180,1034,101,148.5,187,200.5,275,254,242,140,366.5,186.5,13099.5,143,193,175,229,2812,261,210.5,162,1152,195,318,2433,2290,157,140,138,97,193,141,96,121,170,142,204,122,96.5,145.5,150,123.5,74,141,105,155,231,61,112,201.5,265,20251,2.6803355,2.3180633,2.1958997,2.1461279,2.4174716,2.139879,2.0791812,1.9867717,2.2855573,2.3607826,2.3354578,2.149219,3.2972131,1.9822712,2.9752018,3.1020906,3.5553362,3.071882,3.0145206,2.0043213,2.1717265,2.2718415,2.0827854,2.3021145,2.4393327,2.4048338,2.230449,2.1522884,2.3838153,2.3096302,2.1461279,2.564074,2.0863597,2.2706788,4.1172547,1.9845273,2.1553361,2.162863,2.2855573,2.2430379,2.3598354,2.1760912,3.4490154,2.0916669,1.8692317,2.4166405,2.149219,2.3232522,2.0211892,2.1903317,2.2095151,3.0614524,2.2900345,2.3636119,2.5024271,3.386142,3.3598354,1.7853298,2.0492179,2.304275,,19.4,0=Troponin Negative,,<215,0<500,19.76,9.15,19,23
1009,1=Sharp,COVID,4,5,Moderate-Severe,52,0=Non-Hispanic,0=Other,1=male,41.450001,0=Not Transplant,1=Steroid,1=Remdexivir,0,0=No ventilation,0=No Cardiac Disease,0=No Pulmonary Disease,0=No Diabetes,0=No Kidney Disease,12,AT1R>=10,0,48,ECXM Negative,584,1005,9675,273,567.5,941,2809,289.5,2367,1649,572,398.5,2712,365,1481,851.5,1609,293,4529.5,259.5,141,464,432,907.5,854,730,8853,1078,757,332,226,9072,901,339.5,771,566.5,357,283,216.5,318,424,206,565.5,396.5,283,222,298.5,252,916.5,141.5,1070,107,537.5,126,150,323,334.5,111,224.5,450.5,306,19706,2.7664127,3.002166,2.5526683,2.4517865,3.985651,2.3354578,2.4361627,2.5024271,2.6273658,2.7539659,2.9735897,2.3138673,3.4485517,2.7524326,2.4616485,3.3741982,3.2172205,2.757396,2.6004283,3.4332898,2.5622928,3.1705551,2.5982432,2.9301846,3.2065561,2.4668677,2.4517865,2.3463531,3.6560502,2.4749444,2.4141374,2.149219,2.4014006,2.666518,2.6354837,2.9621325,2.9578466,2.1507564,2.9314578,2.863323,3.9470904,3.0293837,3.0326188,2.0293837,2.7303784,2.8790958,2.1003706,2.5211382,2.1760912,2.5092025,2.3541083,3.9577031,2.9547248,2.5243962,2.5308397,2.8870544,2.7531998,2.0453229,2.3512163,2.6536949,,8,0=Troponin Negative,,1639,1000-1999,<3.00,9.2,<12,46
1010,1=Sharp,COVID,6,5,Moderate-Severe,27,1=Hispanic,0=Other,0=female,38.709999,0=Not Transplant,1=Steroid,1=Remdexivir,0,0=No ventilation,0=No Cardiac Disease,0=No Pulmonary Disease,0=No Diabetes,0=No Kidney Disease,10,AT1R>=10,,,,217.5,197,534,144,309.5,428,1516,187,301,800,259,200,77.5,174,237,377,218,174,196,111,174,657,324,186,585,2855,245.5,447.5,840,168,170.5,453.5,147,210,2366.5,267,145,106,139,155,152,115,38,90,183,167,126.5,135,861,123,184.5,161,287.5,65,92.5,126,147,47,261,240.5,149,20003,2.3374593,2.2944663,2.1613679,2.0253057,2.7275412,2.1430149,2.1583624,2.1903317,2.1818435,2.4906607,2.6314437,2.0606978,3.1806991,1.5797836,2.2718415,2.4785664,2.90309,2.4132998,2.3010299,1.8893017,2.2405493,2.3747482,1.9542425,2.5763414,2.3384564,2.2405493,2.2624512,2.2227166,2.2922561,2.1020906,2.0453229,2.2405493,2.1303337,2.8175654,2.510545,2.935003,2.2695129,2.089905,2.7671559,3.4556062,2.3900516,2.2659965,2.6507931,2.206826,2.458638,2.9242792,1.8129133,2.2253094,1.9661417,2.1003706,2.2317245,2.6565773,2.1673174,2.1673174,2.3222194,3.3741064,2.4265113,1.6720978,2.4166405,2.3811152,,2.8,0=Troponin Negative,,1294,1000-1999,10.31,16,103,35
1011,1=Sharp,COVID,5,5,Moderate-Severe,62,0=Non-Hispanic,1=White,1=male,29.32,0=Not Transplant,1=Steroid,1=Remdexivir,0,0=No ventilation,0=No Cardiac Disease,0=No Pulmonary Disease,0=No Diabetes,0=No Kidney Disease,16,AT1R>=10,30,62,ECXM Positive,427,604,328,2909,319,950.5,1180,541.5,1002,2099,640,702,843,280.5,8542.5,425.5,383.5,190,598,341,137,201,953.5,1134,435,580,395.5,1038.5,344,350.5,413.5,4473,146,320,1011,607.5,226,168,222,218,333,164,240.5,561,195,169,280.5,284,412,122,470.5,256,137,55,103,250,226.5,138,255,307,309,20098.5,2.6304278,2.7810369,2.3541083,2.2253094,2.5158739,2.3463531,3.4637437,2.3384564,2.5224442,2.5037906,2.977952,2.2148438,3.071882,2.3811152,2.7335985,3.0008676,3.3220124,2.80618,2.8463371,2.9258275,2.447933,3.9315851,2.7489629,2.6288996,2.5837653,2.2787535,2.2900345,2.2278867,2.7767012,2.447933,2.5327544,2.1367207,2.4533184,2.303196,2.9793208,2.6148973,3.0546131,2.0863597,2.6384892,2.763428,2.5971465,2.6725597,3.0164065,2.4082401,2.1367207,2.5365584,1.7403626,2.544688,2.0128372,2.3979399,2.6164756,3.650599,2.1643529,2.3550682,2.5051501,3.0047512,2.7835462,2.139879,2.4065402,2.4871383,,8.4,0=Troponin Negative,,862,500-999,2.7,<4.01,43,22
1012,1=Sharp,COVID,8,4,Moderate-Severe,57,0=Non-Hispanic,1=White,1=male,32.009998,0=Not Transplant,0=No Steroid,0=No Remdexivir,0,0=No ventilation,1=PMH Cardiac Disease,0=No Pulmonary Disease,1=PMH Diabetes,0=No Kidney Disease,18,AT1R>=10,23,64,ECXM Positive,526,943,1054,425,487,410.5,2269.5,296,657.5,1568,319,312,152.5,477,484,1076,1490,1065,951.5,357.5,142,318.5,1936,1545,956,513.5,587.5,731.5,753,723,530,1298.5,200,325,687,550,246,202,243.5,233.5,295,125,250,294,198,176,584,386,1025.5,135,377,133,208,50,146,278,269.5,190.5,184,435.5,339,20110.5,2.7209857,2.9745116,2.3909352,2.3053513,3.0228405,2.3864989,2.6283889,2.3682868,2.4698219,2.6875288,2.6133132,2.09691,3.3559301,2.3979399,2.4712918,2.8178957,3.1953461,2.5037906,2.4941547,2.1832697,2.6785183,2.6848454,2.4683473,3.0318122,3.1731863,3.0273497,2.2966652,2.2455127,2.9784088,2.7664127,2.5532761,2.1522884,2.5865872,2.5031095,3.2869053,3.0109358,3.1889284,2.1303337,2.9804578,2.7105405,2.7690079,2.5763414,2.8642144,2.1238515,2.3180633,2.8767951,1.69897,2.8591383,2.1643529,2.4440448,2.7242758,3.1134419,2.3010299,2.4305587,2.5118833,2.8369567,2.7403626,2.2798951,2.2648177,2.6389883,,22.5,1=Troponin Positive,,984,500-999,40.3,6.57,29,24
1013,1=Sharp,COVID,5,5,Moderate-Severe,41,0=Non-Hispanic,1=White,1=male,36.990002,0=Not Transplant,1=Steroid,1=Remdexivir,0,0=No ventilation,0=No Cardiac Disease,0=No Pulmonary Disease,0=No Diabetes,0=No Kidney Disease,6,AT1R<10,0,0,ECXM Negative,223,361,1401,180,395,287,3177,291,355,1192,369,355.5,159.5,326,379,361,278.5,399.5,803.5,371,97,233,3366,290,386.5,268.5,321.5,742,430,2386.5,195,2259.5,473.5,262,989.5,448.5,262,855,145,135,167,215.5,278,227.5,400,163.5,90,190,187.5,154,213.5,117,145.5,37,134,228,192,133,210.5,227,316,20080,2.3483047,2.5575073,2.4183013,2.9319661,3.1464381,2.1613679,2.2552724,2.1303337,2.2227166,2.5965972,2.4578819,2.3334472,3.5020173,2.4440448,2.4638929,2.5502284,3.0762763,2.5670264,2.5508397,2.2027607,2.5132177,2.5786393,2.3569815,2.5575073,2.4448252,2.6015167,2.6020601,2.2135177,2.9049859,1.9542425,2.5693738,1.9867717,2.2787535,2.3673558,3.5271142,2.2730012,2.4623981,2.1875207,2.5871494,2.4289443,2.5071809,2.3293979,2.870404,2.0681858,2.162863,2.6334684,1.5682018,3.3777614,2.1271048,2.357935,2.2900345,3.3540123,2.6753199,2.2833011,2.4183013,2.9954157,2.6517625,2.1238515,2.3232522,2.3560259,,5.8,0=Troponin Negative,,876,500-999,7.75,4.1,21,51
1014,1=Sharp,COVID,22,7,Critical-Deceased,26,1=Hispanic,0=Other,0=female,,0=Not Transplant,1=Steroid,0=No Remdexivir,0,1=Ventilation,0=No Cardiac Disease,0=No Pulmonary Disease,1=PMH Diabetes,0=No Kidney Disease,40,AT1R>=10,71,55,ECXM Positive,403,444.5,1053.5,708,306.5,370,5563,2085,2897,5614,2359,2446.5,635.5,409,944,684.5,397,458,456,817,350,434,898,580,555,606,842.5,5118,686,3888.5,5667.5,1803.5,621,1526,4334.5,7907,471,366,584,343,277,455,209,446,505,253,1379.5,680,286.5,781,1405,350,216,206,352,418.5,221,491,4669.5,377,1204,19996,2.605305,2.6478717,2.6730208,2.5634811,3.0226345,2.7664127,2.8500333,2.5352941,2.4424798,2.4864304,2.5682018,2.6580114,3.7453091,2.3201463,3.3191061,3.4619484,3.7492723,3.3727279,3.3885453,2.8031156,2.6117234,2.974972,2.6493349,2.8353734,2.5987904,2.6608655,2.7032914,2.4031205,2.6589649,3.1397216,2.9122221,2.5440681,2.8325088,2.6374898,2.9532764,2.4571247,2.763428,2.8926511,2.744293,2.7824726,2.92557,3.1476762,3.7091002,2.5440681,2.3344538,2.8363242,2.3138673,3.589782,2.5465426,2.6216955,3.7533915,3.2561162,2.7930915,2.3443923,3.1835546,3.636939,3.8980117,2.6910815,3.6692703,2.5763414,,12.4,0=Troponin Negative,,1230,1000-1999,10.55,<4.01,17,21
1015,1=Sharp,COVID,7,5,Moderate-Severe,58,0=Non-Hispanic,3=Asian,1=male,27.059999,0=Not Transplant,1=Steroid,0=No Remdexivir,0,0=No ventilation,0=No Cardiac Disease,0=No Pulmonary Disease,0=No Diabetes,0=No Kidney Disease,9,AT1R<10,130,157,ECXM Positive,432.5,1037.5,1972,2904.5,780,887,5661,594,776,2263,651,1091.5,167.5,777,567,828,3805,392,1439,531,559,342.5,950.5,577,538.5,1258,879,1610,610,468.5,550,6722.5,640,764.5,1343,13126,2988,98.5,219,433,359.5,412.5,940,528,516.5,305,1157.5,282,404.5,139,298,467.5,261,227.5,3733,332,392,205,460,612,523,20004,2.6359861,3.0159881,3.4753807,1.9934362,3.2949069,2.3404441,3.4630713,2.636488,2.5556989,2.8920946,2.9479237,2.6154239,3.7528932,2.9731278,2.7737865,2.8898618,3.3546846,2.813581,3.0380237,2.2240148,2.8904209,2.753583,2.7226338,2.9180303,3.5803547,2.593286,2.7130704,2.4842999,3.1580608,3.0635209,2.7250946,2.7474117,2.4502492,2.5346606,2.977952,2.6069186,2.7611759,2.1430149,2.7311857,3.0996807,2.9439888,2.4742162,3.206826,2.6697817,2.4166405,2.7853298,2.3569815,2.6707096,3.572058,2.5211382,2.7403626,3.8275309,2.80618,2.593286,2.8833776,3.1280761,4.1181326,2.3117537,2.6627579,2.7867515,,4,0=Troponin Negative,,328,0<500,17.68,<4.01,16,10
1016,1=Sharp,COVID,5,4,Moderate-Severe,23,0=Non-Hispanic,1=White,0=female,,0=Not Transplant,1=Steroid,0=No Remdexivir,0,0=No ventilation,0=No Cardiac Disease,1=PMH Pulmonary Disease,0=No Diabetes,0=No Kidney Disease,10,AT1R>=10,65,52,ECXM Positive,347,653,1113,410,593.5,943.5,2174.5,571.5,894,1602,458,528,162,417,536,522,601,392,351,166,380,426,458,711,462,441,954,900,505,272,421.5,8071,354,356,601.5,669,171,195,268,498,312,251.5,420,342,366,205,307,376,390,247,212,155,163.5,299,203.5,296,350,188,239,398,279,20025,2.5403295,2.8149133,2.2329962,2.2900345,3.0464952,2.4281347,2.6127839,2.6972294,2.4941547,2.7734208,2.9747419,2.400538,3.3373594,2.6232493,2.7570162,2.9513376,3.2046626,2.6608655,2.7226338,2.2095151,2.620136,2.7291648,2.5340261,2.7176704,2.7788744,2.593286,2.5634811,2.3117537,2.5453072,2.4871383,2.220108,2.5797837,2.5751879,2.6294096,2.6608655,2.5910647,2.8518696,2.3926969,2.6646419,2.6444385,2.9795485,2.3263359,2.9542425,2.1903317,2.2135177,2.7032914,2.4756713,2.4345689,2.3085644,2.4712918,2.6247976,3.9069273,2.5490034,2.5440681,2.55145,2.7792356,2.8254261,2.2741578,2.3783979,2.5998831,,<2.0,0=Troponin Negative,,654,500-999,<2.45,<4.01,20,21
1017,1=Sharp,COVID,5,5,Moderate-Severe,52,0=Non-Hispanic,1=White,1=male,38.009998,0=Not Transplant,1=Steroid,1=Remdexivir,0,0=No ventilation,0=No Cardiac Disease,0=No Pulmonary Disease,0=No Diabetes,0=No Kidney Disease,28,AT1R>=10,19,2,ECXM Negative,357,1296,561,391,509,577,1338,293.5,616,1275,423.5,477.5,314,429,514.5,603.5,451.5,440.5,514,346,362,152,647.5,823,154.5,607,1709.5,1165,426,374,338,2259.5,959,892.5,698,770,319,213,210.5,155,334,258,341,304,913,203,398,265,314,299.5,190.5,274,231,224,171,347.5,259,220.5,500.5,378,382,19633.5,2.5526683,3.1126051,2.5037906,2.3283796,2.7489629,2.3232522,2.5921767,2.1903317,2.5237465,2.7067177,2.7611759,2.4116197,3.126456,2.5327544,2.4676082,2.7895808,3.1055102,2.6268535,2.6789734,2.4969296,2.6324573,2.7113855,2.4828737,2.7806773,2.6546578,2.6439459,2.9604707,2.3074961,2.710963,2.5998831,2.5390761,2.5587087,2.4232459,2.1818435,2.8112397,2.4969296,2.9153998,2.4763968,2.1889284,2.7831886,3.2328691,2.2798951,3.0663259,2.4377506,2.3636119,2.6294096,2.3502481,2.5728717,2.2329962,2.5409548,2.5289166,3.3540123,2.9818187,2.4132998,2.9506083,2.8438554,2.8864908,2.3434086,2.699404,2.5774918,,11.2,0=Troponin Negative,,1537,1000-1999,10.18,5.54,18,26
1018,1=Sharp,COVID,17,4,Moderate-Severe,30,0=Non-Hispanic,2=Black,1=male,35.349998,0=Not Transplant,0=No Steroid,0=No Remdexivir,0,0=No ventilation,0=No Cardiac Disease,0=No Pulmonary Disease,0=No Diabetes,1=PMH Kidney Disease,9,AT1R<10,13,0,ECXM Negative,225.5,510.5,3660,226,574,908,1565,253,466.5,1047,416.5,427,176,383,447,268.5,281,401,805,566,139,181,2751.5,276,583,2074,450,1098,514,276,343,1087,501,959,696,489,484.5,69.5,156,135,246.5,253,384,235,419,305,178,221.5,474,96.5,765.5,220,329.5,107,198,172,198.5,191.5,324.5,260,311.5,20174,2.3531466,2.7079957,2.6852937,1.8419847,3.5634811,2.1931245,2.3541083,2.1303337,2.3918169,2.7589118,2.9580858,2.4031205,3.1945143,2.5843313,2.4031205,2.6688516,3.0199466,2.6196151,2.6304278,2.2455127,2.5831988,2.6503074,2.3710678,2.4289443,2.4487064,2.6031444,2.6222141,2.4842999,2.9057958,2.2504201,2.7528164,2.1430149,2.3453736,2.2576785,3.4395695,2.6757784,2.4409091,1.9845273,2.7656686,3.3168087,2.6532125,2.8839452,3.0406024,2.3424227,2.5178554,2.710963,2.0293837,2.4409091,2.2966652,2.2355285,2.5352941,3.0362296,2.6998377,2.2977605,2.9818187,2.8426092,2.6893089,2.2821689,2.5112147,2.4149733,,39.3,1=Troponin Positive,,1093,1000-1999,4.38,35.9,13,37